Information card for entry 4322522
Formula | C31 H32 B Eu N11 O7.5 |
Calculated formula | C31 H27 B Eu N11 O7.5 |
Title of publication | Structural and Photophysical Properties of Mononuclear and Dinuclear Lanthanide(III) Complexes of Multidentate Podand Ligands Based on Poly(pyrazolyl)borates |
Authors of publication | Nicola Armaroli; Gianluca Accorsi; Francesco Barigelletti; Samantha M. Couchman; James S. Fleming; Nicholas C. Harden; John C. Jeffery; Karen L. V. Mann; Jon A. McCleverty; Leigh H. Rees; Sarah R. Starling; Michael D. Ward |
Journal of publication | Inorganic Chemistry |
Year of publication | 1999 |
Journal volume | 38 |
Pages of publication | 5769 - 5776 |
a | 10.02 ± 0.003 Å |
b | 13.036 ± 0.003 Å |
c | 14.74 ± 0.003 Å |
α | 70.114 ± 0.014° |
β | 71.55 ± 0.02° |
γ | 79.66 ± 0.02° |
Cell volume | 1711.9 ± 0.8 Å3 |
Cell temperature | 173 ± 2 K |
Ambient diffraction temperature | 173 ± 2 K |
Number of distinct elements | 6 |
Space group number | 2 |
Hermann-Mauguin space group symbol | P -1 |
Hall space group symbol | -P 1 |
Residual factor for all reflections | 0.0989 |
Residual factor for significantly intense reflections | 0.0513 |
Weighted residual factors for all reflections | 0.133 |
Weighted residual factors for significantly intense reflections | 0.096 |
Goodness-of-fit parameter for all reflections | 0.956 |
Goodness-of-fit parameter for significantly intense reflections | 0.86 |
Diffraction radiation wavelength | 0.71073 Å |
Diffraction radiation type | MoKα |