Information card for entry 4322540
Common name | lanthanum(III) hypophosphite hydrate |
Formula | C0 H8 La O7 P3 |
Calculated formula | H8 La O7 P3 |
Title of publication | Synthesis, Structure, and Spectroscopy of Rare Earth Hypophosphites. 1. Anhydrous and Monohydrated Lanthanide Hypophosphites |
Authors of publication | Peter A. Tanner; Michele D. Faucher; Thomas C. W. Mak |
Journal of publication | Inorganic Chemistry |
Year of publication | 1999 |
Journal volume | 38 |
Pages of publication | 6008 - 6023 |
a | 7.229 ± 0.001 Å |
b | 7.983 ± 0.001 Å |
c | 8.934 ± 0.002 Å |
α | 110.57 ± 0.02° |
β | 98.26 ± 0.01° |
γ | 104.35 ± 0.01° |
Cell volume | 452.26 ± 0.16 Å3 |
Cell temperature | 293 ± 2 K |
Ambient diffraction temperature | 293 ± 2 K |
Number of distinct elements | 5 |
Space group number | 2 |
Hermann-Mauguin space group symbol | P -1 |
Hall space group symbol | -P 1 |
Residual factor for all reflections | 0.0293 |
Residual factor for significantly intense reflections | 0.0262 |
Weighted residual factors for significantly intense reflections | 0.0672 |
Weighted residual factors for all reflections included in the refinement | 0.0683 |
Goodness-of-fit parameter for all reflections included in the refinement | 1.075 |
Diffraction radiation wavelength | 0.71073 Å |
Diffraction radiation type | MoKα |