Information card for entry 4324136
Formula | C77.7 H50.9 Cl0.4 F20 O P4 Pd Pt2 |
Calculated formula | C77.7 H50.9 Cl0.4 F20 O P4 Pd Pt2 |
Title of publication | Synthesis, Dynamic Behavior, and Reactivity of New Unsaturated Heterotrinuclear 46 Valence Electron Complexes Polynuclear Homo- or Heterometallic Palladium(II)-Platinum(II) Pentafluorophenyl Complexes Containing Bridging Diphenylphosphido Ligands. 27. For part 26, see ref 1. |
Authors of publication | Juan Forniés; Consuelo Fortuño; Susana Ibáñez; Antonio Martín; Pilar Romero; Piero Mastrorilli; Vito Gallo |
Journal of publication | Inorganic Chemistry |
Year of publication | 2011 |
Journal volume | 50 |
Pages of publication | 285 - 298 |
a | 11.8043 ± 0.0019 Å |
b | 15.666 ± 0.003 Å |
c | 21.543 ± 0.004 Å |
α | 95.649 ± 0.003° |
β | 96.502 ± 0.003° |
γ | 108.579 ± 0.003° |
Cell volume | 3713.5 ± 1.2 Å3 |
Cell temperature | 100 ± 2 K |
Ambient diffraction temperature | 100 ± 2 K |
Number of distinct elements | 8 |
Space group number | 2 |
Hermann-Mauguin space group symbol | P -1 |
Hall space group symbol | -P 1 |
Residual factor for all reflections | 0.0614 |
Residual factor for significantly intense reflections | 0.0467 |
Weighted residual factors for significantly intense reflections | 0.1106 |
Weighted residual factors for all reflections included in the refinement | 0.1181 |
Goodness-of-fit parameter for all reflections included in the refinement | 1.058 |
Diffraction radiation wavelength | 0.71073 Å |
Diffraction radiation type | MoKα |