Information card for entry 4324190
Formula | C46 H80 B2 N12 Ni2 O8 P2 |
Calculated formula | C46 H80 B2 N12 Ni2 O8 P2 |
Title of publication | Crystal Structures and Magnetic Properties of Nickel Complexes with Hydrotris(pyrazolyl)borate Ligand and Double Bridged by Phosphate Esters |
Authors of publication | Luisa López-Banet; M. Dolores Santana; Gabriel García; Luis García; José Pérez; Teófilo Rojo; Luis Lezama; Jean-Pierre Costes |
Journal of publication | Inorganic Chemistry |
Year of publication | 2011 |
Journal volume | 50 |
Pages of publication | 437 - 443 |
a | 16.533 Å |
b | 16.533 Å |
c | 20.512 Å |
α | 90° |
β | 90° |
γ | 90° |
Cell volume | 5606.75 Å3 |
Cell temperature | 100 ± 2 K |
Ambient diffraction temperature | 100 ± 2 K |
Number of distinct elements | 7 |
Space group number | 135 |
Hermann-Mauguin space group symbol | P 42/m b c |
Hall space group symbol | -P 4c 2ab |
Residual factor for all reflections | 0.0598 |
Residual factor for significantly intense reflections | 0.0559 |
Weighted residual factors for significantly intense reflections | 0.1519 |
Weighted residual factors for all reflections included in the refinement | 0.155 |
Goodness-of-fit parameter for all reflections included in the refinement | 1.077 |
Diffraction radiation wavelength | 0.71073 Å |
Diffraction radiation type | MoKα |