Information card for entry 4324200
Formula | C66.5 H52.5 Cl7.5 P2 Pt S4 |
Calculated formula | C66.5 H52.5 Cl7.5 P2 Pt S4 |
Title of publication | Photochromic Alkynes as Versatile Building Blocks for Metal Alkynyl Systems: Design, Synthesis, and Photochromic Studies of Diarylethene-Containing Platinum(II) Phosphine Alkynyl Complexes |
Authors of publication | Hok-Lai Wong; Chi-Hang Tao; Nianyong Zhu; Vivian Wing-Wah Yam |
Journal of publication | Inorganic Chemistry |
Year of publication | 2011 |
Journal volume | 50 |
Pages of publication | 471 - 481 |
a | 8.196 ± 0.001 Å |
b | 11.971 ± 0.0013 Å |
c | 36.875 ± 0.005 Å |
α | 97.64 ± 0.02° |
β | 95.55 ± 0.02° |
γ | 97.61 ± 0.02° |
Cell volume | 3530.1 ± 0.8 Å3 |
Cell temperature | 301 ± 2 K |
Ambient diffraction temperature | 301 ± 2 K |
Number of distinct elements | 6 |
Space group number | 2 |
Hermann-Mauguin space group symbol | P -1 |
Hall space group symbol | -P 1 |
Residual factor for all reflections | 0.0463 |
Residual factor for significantly intense reflections | 0.0424 |
Weighted residual factors for significantly intense reflections | 0.1058 |
Weighted residual factors for all reflections included in the refinement | 0.1074 |
Goodness-of-fit parameter for all reflections included in the refinement | 1.179 |
Diffraction radiation wavelength | 0.71073 Å |
Diffraction radiation type | MoKα |