Information card for entry 4324211
Formula | C34 H40 Br2 Cr4 N2 O18 Pb2 |
Calculated formula | C34 H40 Br2 Cr4 N2 O18 Pb2 |
SMILES | C([Cr](C#[O])(C#[O])(C#[O])(C#[O])[Pb]1(Br)[Cr](C#[O])(C#[O])(C#[O])(C#[O])[Pb](Br)([Cr](C#[O])(C#[O])(C#[O])(C#[O])C#[O])[Cr]1(C#[O])(C#[O])(C#[O])C#[O])#[O].[N+](CC)(CC)(CC)CC.[N+](CC)(CC)(CC)CC |
Title of publication | Lead-Chromium Carbonyl Complexes Incorporated with Group 8 Metals: Synthesis, Reactivity, and Theoretical Calculations |
Authors of publication | Minghuey Shieh; Yen-Yi Chu; Miao-Hsing Hsu; Wei-Ming Ke; Chien-Nan Lin |
Journal of publication | Inorganic Chemistry |
Year of publication | 2011 |
Journal volume | 50 |
Pages of publication | 565 - 575 |
a | 9.5681 ± 0.0002 Å |
b | 24.6016 ± 0.0006 Å |
c | 11.3668 ± 0.0003 Å |
α | 90° |
β | 101.805 ± 0.001° |
γ | 90° |
Cell volume | 2619.05 ± 0.11 Å3 |
Cell temperature | 298 ± 2 K |
Ambient diffraction temperature | 298 ± 2 K |
Number of distinct elements | 7 |
Space group number | 14 |
Hermann-Mauguin space group symbol | P 1 21/c 1 |
Hall space group symbol | -P 2ybc |
Residual factor for all reflections | 0.095 |
Residual factor for significantly intense reflections | 0.0709 |
Weighted residual factors for significantly intense reflections | 0.172 |
Weighted residual factors for all reflections included in the refinement | 0.1838 |
Goodness-of-fit parameter for all reflections included in the refinement | 1.028 |
Diffraction radiation wavelength | 0.71073 Å |
Diffraction radiation type | MoKα |