Information card for entry 4324214
Formula | C35 H40 Cr2 N2 O19 Pb2 Ru3 |
Calculated formula | C35 H40 Cr2 N2 O19 Pb2 Ru3 |
SMILES | [Pb]12([Ru]34([Pb]5([Ru]13([Ru]245(C#[O])(C#[O])C#[O])(C#[O])(C#[O])C#[O])[Cr](C#[O])(C#[O])(C#[O])(C#[O])C#[O])(C#[O])(C#[O])C#[O])[Cr](C#[O])(C#[O])(C#[O])(C#[O])C#[O].[N+](CC)(CC)(CC)CC.[N+](CC)(CC)(CC)CC |
Title of publication | Lead-Chromium Carbonyl Complexes Incorporated with Group 8 Metals: Synthesis, Reactivity, and Theoretical Calculations |
Authors of publication | Minghuey Shieh; Yen-Yi Chu; Miao-Hsing Hsu; Wei-Ming Ke; Chien-Nan Lin |
Journal of publication | Inorganic Chemistry |
Year of publication | 2011 |
Journal volume | 50 |
Pages of publication | 565 - 575 |
a | 12.1695 ± 0.0001 Å |
b | 18.2147 ± 0.0003 Å |
c | 23.5738 ± 0.0003 Å |
α | 90° |
β | 103.097 ± 0.0006° |
γ | 90° |
Cell volume | 5089.54 ± 0.11 Å3 |
Cell temperature | 298 ± 2 K |
Ambient diffraction temperature | 298 ± 2 K |
Number of distinct elements | 7 |
Space group number | 14 |
Hermann-Mauguin space group symbol | P 1 21/n 1 |
Hall space group symbol | -P 2yn |
Residual factor for all reflections | 0.0893 |
Residual factor for significantly intense reflections | 0.0454 |
Weighted residual factors for significantly intense reflections | 0.082 |
Weighted residual factors for all reflections included in the refinement | 0.0942 |
Goodness-of-fit parameter for all reflections included in the refinement | 1.037 |
Diffraction radiation wavelength | 0.71073 Å |
Diffraction radiation type | MoKα |