Information card for entry 4324219
Formula | C33 H40 Hg N2 O7 S2 |
Calculated formula | C33 H40 Hg N2 O7 S2 |
SMILES | [Hg]1(Sc2ccc([N+](C)(C)C)cc2)(Sc2ccc([N+](C)(C)C)cc2)OC(=[O]1)c1c(O)cccc1.O=C([O-])c1c(O)cccc1.OC |
Title of publication | Binding of a Coordinatively Unsaturated Mercury(II) Thiolate Compound by Carboxylate Anions |
Authors of publication | Xiao-Yan Tang; Ai-Xia Zheng; Hai Shang; Rong-Xin Yuan; Hong-Xi Li; Zhi-Gang Ren; Jian-Ping Lang |
Journal of publication | Inorganic Chemistry |
Year of publication | 2011 |
Journal volume | 50 |
Pages of publication | 503 - 516 |
a | 9.6245 ± 0.0019 Å |
b | 12.634 ± 0.003 Å |
c | 14.069 ± 0.003 Å |
α | 80.34 ± 0.03° |
β | 88.57 ± 0.03° |
γ | 89.27 ± 0.03° |
Cell volume | 1685.9 ± 0.7 Å3 |
Cell temperature | 193 ± 2 K |
Ambient diffraction temperature | 193 ± 2 K |
Number of distinct elements | 6 |
Space group number | 2 |
Hermann-Mauguin space group symbol | P -1 |
Hall space group symbol | -P 1 |
Residual factor for all reflections | 0.0496 |
Residual factor for significantly intense reflections | 0.0411 |
Weighted residual factors for significantly intense reflections | 0.0773 |
Weighted residual factors for all reflections included in the refinement | 0.0811 |
Goodness-of-fit parameter for all reflections included in the refinement | 1.04 |
Diffraction radiation wavelength | 0.71073 Å |
Diffraction radiation type | MoKα |