Information card for entry 4324226
Formula | C24 H20 As4 Mo4 N2 O25 |
Calculated formula | C24 H20 As4 Mo4 N2 O25 |
Title of publication | Self-Assembly of Hybrid Organic-Inorganic Polyoxomolybdates: Solid-State Structures and Investigation of Formation and Core Rearrangements in Solution |
Authors of publication | Camelia I. Onet; Lei Zhang; Rodolphe Clérac; J. Bernard Jean-Denis; Martin Feeney; Thomas McCabe; Wolfgang Schmitt |
Journal of publication | Inorganic Chemistry |
Year of publication | 2011 |
Journal volume | 50 |
Pages of publication | 604 - 613 |
a | 10.009 ± 0.004 Å |
b | 15.767 ± 0.005 Å |
c | 17.287 ± 0.005 Å |
α | 117.09 ± 0.02° |
β | 96.03 ± 0.02° |
γ | 98.454 ± 0.018° |
Cell volume | 2356.1 ± 1.5 Å3 |
Cell temperature | 118 ± 2 K |
Ambient diffraction temperature | 118 ± 2 K |
Number of distinct elements | 6 |
Space group number | 2 |
Hermann-Mauguin space group symbol | P -1 |
Hall space group symbol | -P 1 |
Residual factor for all reflections | 0.1171 |
Residual factor for significantly intense reflections | 0.0985 |
Weighted residual factors for significantly intense reflections | 0.2684 |
Weighted residual factors for all reflections included in the refinement | 0.2869 |
Goodness-of-fit parameter for all reflections included in the refinement | 1.036 |
Diffraction radiation wavelength | 0.71075 Å |
Diffraction radiation type | MoKα |