Information card for entry 4324244
Common name | polyaluminum chloride sulphate |
Chemical name | polyaluminum chloride sulphate |
Formula | Al32 Cl2 H176 O162 S9 |
Calculated formula | Al32 Cl2 H176 O162 S9 |
Title of publication | A Giant Polyaluminum Species S-Al32 and Two Aluminum Polyoxocations Involving Coordination by Sulfate Ions S-Al32 and S-K-Al13 |
Authors of publication | Zhong Sun; Hui Wang; Hong-Ge-Er Tong; Shao-Fan Sun |
Journal of publication | Inorganic Chemistry |
Year of publication | 2011 |
Journal volume | 50 |
Pages of publication | 559 - 564 |
a | 14.949 ± 0.003 Å |
b | 16.384 ± 0.003 Å |
c | 17.055 ± 0.003 Å |
α | 66.79 ± 0.03° |
β | 70.35 ± 0.03° |
γ | 70.32 ± 0.03° |
Cell volume | 3513.4 ± 1.5 Å3 |
Cell temperature | 296 ± 2 K |
Ambient diffraction temperature | 296 ± 2 K |
Number of distinct elements | 5 |
Space group number | 2 |
Hermann-Mauguin space group symbol | P -1 |
Hall space group symbol | -P 1 |
Residual factor for all reflections | 0.2015 |
Residual factor for significantly intense reflections | 0.1158 |
Weighted residual factors for significantly intense reflections | 0.0985 |
Weighted residual factors for all reflections included in the refinement | 0.1231 |
Goodness-of-fit parameter for all reflections included in the refinement | 0.91 |
Diffraction radiation wavelength | 0.71073 Å |
Diffraction radiation type | MoKα |