Information card for entry 4324256
Formula | C46 H46 N10 Ni O16.83 |
Calculated formula | C46 H46 N10 Ni O16.832 |
Title of publication | Homochiral, Helical Supramolecular Metal-Organic Frameworks Organized by Strong π...π Stacking Interactions: Single-Crystal to Single-Crystal Transformations in Closely Packed Solids |
Authors of publication | Daniel L. Reger; Jacob J. Horger; Mark D. Smith; Gary J. Long; Fernande Grandjean |
Journal of publication | Inorganic Chemistry |
Year of publication | 2011 |
Journal volume | 50 |
Pages of publication | 686 - 704 |
a | 11.348 ± 0.0004 Å |
b | 11.348 ± 0.0004 Å |
c | 62.182 ± 0.003 Å |
α | 90° |
β | 90° |
γ | 120° |
Cell volume | 6934.8 ± 0.5 Å3 |
Cell temperature | 295 ± 2 K |
Ambient diffraction temperature | 295 ± 2 K |
Number of distinct elements | 5 |
Space group number | 178 |
Hermann-Mauguin space group symbol | P 61 2 2 |
Hall space group symbol | P 61 2 (0 0 5) |
Residual factor for all reflections | 0.0424 |
Residual factor for significantly intense reflections | 0.0406 |
Weighted residual factors for significantly intense reflections | 0.1022 |
Weighted residual factors for all reflections included in the refinement | 0.1032 |
Goodness-of-fit parameter for all reflections included in the refinement | 1.221 |
Diffraction radiation wavelength | 0.71073 Å |
Diffraction radiation type | MoKα |