Information card for entry 4324263
Formula | C46 H47.36 Co N10 O16.68 |
Calculated formula | C46 H46 Co N10 O16.681 |
Title of publication | Homochiral, Helical Supramolecular Metal-Organic Frameworks Organized by Strong π...π Stacking Interactions: Single-Crystal to Single-Crystal Transformations in Closely Packed Solids |
Authors of publication | Daniel L. Reger; Jacob J. Horger; Mark D. Smith; Gary J. Long; Fernande Grandjean |
Journal of publication | Inorganic Chemistry |
Year of publication | 2011 |
Journal volume | 50 |
Pages of publication | 686 - 704 |
a | 11.3835 ± 0.0002 Å |
b | 11.3835 ± 0.0002 Å |
c | 61.2732 ± 0.0015 Å |
α | 90° |
β | 90° |
γ | 120° |
Cell volume | 6876.3 ± 0.2 Å3 |
Cell temperature | 150 ± 2 K |
Ambient diffraction temperature | 150 ± 2 K |
Number of distinct elements | 5 |
Space group number | 178 |
Hermann-Mauguin space group symbol | P 61 2 2 |
Hall space group symbol | P 61 2 (0 0 5) |
Residual factor for all reflections | 0.0423 |
Residual factor for significantly intense reflections | 0.0378 |
Weighted residual factors for significantly intense reflections | 0.0865 |
Weighted residual factors for all reflections included in the refinement | 0.0886 |
Goodness-of-fit parameter for all reflections included in the refinement | 1.115 |
Diffraction radiation wavelength | 0.71073 Å |
Diffraction radiation type | MoKα |