Information card for entry 4324275
Formula | C19 H21 N2 P Se |
Calculated formula | C19 H21 N2 P Se |
SMILES | [Se]=P(c1n(ccn1)C(C)(C)C)(c1ccccc1)c1ccccc1 |
Title of publication | Synthesis, Structure, and Reactions of 1-tert-Butyl-2-diphenylphosphino-imidazole |
Authors of publication | Susanne Sauerbrey; Paresh Kumar Majhi; Jörg Daniels; Gregor Schnakenburg; Gerhard Markus Brändle; Katharina Scherer; Rainer Streubel |
Journal of publication | Inorganic Chemistry |
Year of publication | 2011 |
Journal volume | 50 |
Pages of publication | 793 - 799 |
a | 8.6754 ± 0.0002 Å |
b | 9.4666 ± 0.0002 Å |
c | 11.758 ± 0.0003 Å |
α | 87.326 ± 0.001° |
β | 73.395 ± 0.001° |
γ | 74.041 ± 0.001° |
Cell volume | 889.18 ± 0.04 Å3 |
Cell temperature | 133 ± 2 K |
Ambient diffraction temperature | 133 ± 2 K |
Number of distinct elements | 5 |
Space group number | 2 |
Hermann-Mauguin space group symbol | P -1 |
Hall space group symbol | -P 1 |
Residual factor for all reflections | 0.0413 |
Residual factor for significantly intense reflections | 0.0292 |
Weighted residual factors for significantly intense reflections | 0.0628 |
Weighted residual factors for all reflections included in the refinement | 0.0656 |
Goodness-of-fit parameter for all reflections included in the refinement | 1.022 |
Diffraction radiation wavelength | 0.71073 Å |