Information card for entry 4324315
Formula | C12 H13 Cu N3 O7 |
Calculated formula | C12 H13 Cu N3 O7 |
SMILES | c12cc(ccc1[N]1=NC(=C(C)O[Cu]1(O2)[OH2])C(=O)OCC)N(=O)=O |
Title of publication | Ortho-Hydroxyphenylhydrazo-β-Diketones: Tautomery, Coordination Ability, and Catalytic Activity of Their Copper(II) Complexes toward Oxidation of Cyclohexane and Benzylic Alcohols |
Authors of publication | Maximilian N. Kopylovich; Kamran T. Mahmudov; M. Fátima C. Guedes da Silva; PaweÅ‚ J. Figiel; Yauhen Yu. Karabach; Maxim L. Kuznetsov; Konstantin V. Luzyanin; Armando J. L. Pombeiro |
Journal of publication | Inorganic Chemistry |
Year of publication | 2011 |
Journal volume | 50 |
Pages of publication | 918 - 931 |
a | 8.573 ± 0.005 Å |
b | 11.252 ± 0.006 Å |
c | 15.721 ± 0.007 Å |
α | 90.221 ± 0.003° |
β | 100.454 ± 0.006° |
γ | 99.651 ± 0.002° |
Cell volume | 1469.3 ± 1.3 Å3 |
Cell temperature | 150 ± 2 K |
Ambient diffraction temperature | 150 ± 2 K |
Number of distinct elements | 5 |
Space group number | 2 |
Hermann-Mauguin space group symbol | P -1 |
Hall space group symbol | -P 1 |
Residual factor for all reflections | 0.109 |
Residual factor for significantly intense reflections | 0.0694 |
Weighted residual factors for significantly intense reflections | 0.1842 |
Weighted residual factors for all reflections included in the refinement | 0.2072 |
Goodness-of-fit parameter for all reflections included in the refinement | 1.04 |
Diffraction radiation wavelength | 0.71069 Å |
Diffraction radiation type | MoKα |