Information card for entry 4324323
Common name | 4 |
Formula | C35 H46 Cu N3 |
Calculated formula | C35 H46 Cu N3 |
Title of publication | Synthesis and Structure of 6-Aminofulvene-2-aldiminate Complexes |
Authors of publication | Alexander M. Willcocks; Alexander Gilbank; Stephen P. Richards; Simon K. Brayshaw; Andrew J. Kingsley; Raj Odedra; Andrew L. Johnson |
Journal of publication | Inorganic Chemistry |
Year of publication | 2011 |
Journal volume | 50 |
Pages of publication | 937 - 948 |
a | 9.004 ± 0.0002 Å |
b | 9.729 ± 0.0002 Å |
c | 19.846 ± 0.0006 Å |
α | 97.112 ± 0.001° |
β | 91.995 ± 0.001° |
γ | 106.002 ± 0.002° |
Cell volume | 1653.95 ± 0.07 Å3 |
Cell temperature | 150 ± 2 K |
Ambient diffraction temperature | 150 ± 2 K |
Number of distinct elements | 4 |
Space group number | 2 |
Hermann-Mauguin space group symbol | P -1 |
Hall space group symbol | -P 1 |
Residual factor for all reflections | 0.041 |
Residual factor for significantly intense reflections | 0.0327 |
Weighted residual factors for significantly intense reflections | 0.0782 |
Weighted residual factors for all reflections included in the refinement | 0.0831 |
Goodness-of-fit parameter for all reflections included in the refinement | 1.05 |
Diffraction radiation wavelength | 0.71073 Å |
Diffraction radiation type | MoKα |