Information card for entry 4324326
Formula | C18 H20 Cu I N2 O4 S2 |
Calculated formula | C18 H20 Cu I N2 O4 S2 |
Title of publication | Copper(I) Coordination Polymers of N,N'-Bis[3-(methylthio)propyl]pyromellitic Diimide: Crystal Transformation and Solvatochromism by Halogen-π Interactions |
Authors of publication | Garam Park; Hojin Yang; Tae Ho Kim; Jineun Kim |
Journal of publication | Inorganic Chemistry |
Year of publication | 2011 |
Journal volume | 50 |
Pages of publication | 961 - 968 |
a | 7.2384 ± 0.0014 Å |
b | 7.7561 ± 0.0015 Å |
c | 19.188 ± 0.004 Å |
α | 100.062 ± 0.011° |
β | 99.706 ± 0.01° |
γ | 90.402 ± 0.01° |
Cell volume | 1044.8 ± 0.4 Å3 |
Cell temperature | 173 ± 2 K |
Ambient diffraction temperature | 173 ± 2 K |
Number of distinct elements | 7 |
Space group number | 2 |
Hermann-Mauguin space group symbol | P -1 |
Hall space group symbol | -P 1 |
Residual factor for all reflections | 0.0798 |
Residual factor for significantly intense reflections | 0.0647 |
Weighted residual factors for significantly intense reflections | 0.1811 |
Weighted residual factors for all reflections included in the refinement | 0.1876 |
Goodness-of-fit parameter for all reflections included in the refinement | 1.097 |
Diffraction radiation wavelength | 0.71073 Å |
Diffraction radiation type | MoKα |