Information card for entry 4324329
Formula | C19 H22 Cl2 Cu I N2 O4 S2 |
Calculated formula | C19 H22 Cl2 Cu I N2 O4 S2 |
Title of publication | Copper(I) Coordination Polymers of N,N'-Bis[3-(methylthio)propyl]pyromellitic Diimide: Crystal Transformation and Solvatochromism by Halogen-π Interactions |
Authors of publication | Garam Park; Hojin Yang; Tae Ho Kim; Jineun Kim |
Journal of publication | Inorganic Chemistry |
Year of publication | 2011 |
Journal volume | 50 |
Pages of publication | 961 - 968 |
a | 9.4682 ± 0.0007 Å |
b | 10.0563 ± 0.0007 Å |
c | 13.0343 ± 0.0009 Å |
α | 88.669 ± 0.001° |
β | 78.337 ± 0.001° |
γ | 87.533 ± 0.001° |
Cell volume | 1214.18 ± 0.15 Å3 |
Cell temperature | 173 ± 2 K |
Ambient diffraction temperature | 173 ± 2 K |
Number of distinct elements | 8 |
Space group number | 2 |
Hermann-Mauguin space group symbol | P -1 |
Hall space group symbol | -P 1 |
Residual factor for all reflections | 0.0402 |
Residual factor for significantly intense reflections | 0.0283 |
Weighted residual factors for significantly intense reflections | 0.0702 |
Weighted residual factors for all reflections included in the refinement | 0.0826 |
Goodness-of-fit parameter for all reflections included in the refinement | 1.108 |
Diffraction radiation wavelength | 0.71073 Å |
Diffraction radiation type | MoKα |