Information card for entry 4324394
Formula | C24 H15 N6 O4 Re |
Calculated formula | C24 H15 N6 O4 Re |
SMILES | [Re]1(C#[O])(C#[O])(C#[O])([n]2c3c(ccc2)ccc2c3[n]1ccc2)n1nc(nn1)c1ccc(cc1)C(=O)C |
Title of publication | Synthesis, Structural, and Photophysical Investigation of Diimine Triscarbonyl Re(I) Tetrazolato Complexes. |
Authors of publication | Melissa V. Werrett; Daniel Chartrand; Julian D. Gale; Garry S. Hanan; Jonathan G. MacLellan; Massimiliano Massi; Sara Muzzioli; Paolo Raiteri; Brian W. Skelton; Morry Silberstein; Stefano Stagni |
Journal of publication | Inorganic Chemistry |
Year of publication | 2011 |
Journal volume | 50 |
Pages of publication | 1229 - 1241 |
a | 7.4626 ± 0.0001 Å |
b | 17.8403 ± 0.0003 Å |
c | 16.7636 ± 0.0003 Å |
α | 90° |
β | 99.457 ± 0.002° |
γ | 90° |
Cell volume | 2201.49 ± 0.06 Å3 |
Cell temperature | 100 ± 2 K |
Ambient diffraction temperature | 100 ± 2 K |
Number of distinct elements | 5 |
Space group number | 14 |
Hermann-Mauguin space group symbol | P 1 21/n 1 |
Hall space group symbol | -P 2yn |
Residual factor for all reflections | 0.0427 |
Residual factor for significantly intense reflections | 0.0236 |
Weighted residual factors for significantly intense reflections | 0.0438 |
Weighted residual factors for all reflections included in the refinement | 0.0461 |
Goodness-of-fit parameter for all reflections included in the refinement | 0.914 |
Diffraction radiation wavelength | 0.71073 Å |
Diffraction radiation type | MoKα |