Information card for entry 4324423
Formula | C44 H63 Cl Gd2 N6 Ni2 O25 S2 |
Calculated formula | C44 H62 Cl Gd2 N6 Ni2 O25 S2 |
SMILES | [Gd]1234([OH]5[Gd]678([OH]1[Ni]19%10([N](Nc%11sc%12ccccc%12[n]1%11)=Cc1c([O]79[Ni]579([N](Nc5sc%11ccccc%11[n]57)=Cc5c([O]29%10)c([O]3C)ccc5)[O]=C(O4)C)c([O]8C)ccc1)[O]=C(O6)C)(OC(=O)C)([OH]C)O)(OC(=O)C)([OH]C)[OH]C.Cl(=O)(=O)(=O)[O-].OC.OC.OC |
Title of publication | Heterometallic Cubanes: Syntheses, Structures, and Magnetic Properties of Lanthanide(III)-Nickel(II) Architectures |
Authors of publication | Yajie Gao; Lang Zhao; Xuebin Xu; Gong-Feng Xu; Yun-Nan Guo; Jinkui Tang; Zhiliang Liu |
Journal of publication | Inorganic Chemistry |
Year of publication | 2011 |
Journal volume | 50 |
Pages of publication | 1304 - 1308 |
a | 14.3637 ± 0.0008 Å |
b | 26.6503 ± 0.0015 Å |
c | 14.9105 ± 0.0008 Å |
α | 90° |
β | 90° |
γ | 90° |
Cell volume | 5707.7 ± 0.5 Å3 |
Cell temperature | 191 ± 2 K |
Ambient diffraction temperature | 191 ± 2 K |
Number of distinct elements | 8 |
Space group number | 33 |
Hermann-Mauguin space group symbol | P n a 21 |
Hall space group symbol | P 2c -2n |
Residual factor for all reflections | 0.0353 |
Residual factor for significantly intense reflections | 0.0302 |
Weighted residual factors for significantly intense reflections | 0.0696 |
Weighted residual factors for all reflections included in the refinement | 0.0781 |
Goodness-of-fit parameter for all reflections included in the refinement | 1.04 |
Diffraction radiation wavelength | 0.71073 Å |
Diffraction radiation type | MoKα |