Information card for entry 4324447
Formula | C64 H152 K Lu2 N6 O10 Si8 |
Calculated formula | C64 H152 K Lu2 N6 O10 Si8 |
Title of publication | (N2)3- Radical Chemistry via Trivalent Lanthanide Salt/Alkali Metal Reduction of Dinitrogen: New Syntheses and Examples of (N2)2- and (N2)3- Complexes and Density Functional Theory Comparisons of Closed Shell Sc3+, Y3+, and Lu3+ versus 4f9 Dy3+ |
Authors of publication | Ming Fang; Jefferson E. Bates; Sara E. Lorenz; David S. Lee; Daniel B. Rego; Joseph W. Ziller; Filipp Furche; William J. Evans |
Journal of publication | Inorganic Chemistry |
Year of publication | 2011 |
Journal volume | 50 |
Pages of publication | 1459 - 1469 |
a | 15.892 ± 0.006 Å |
b | 24.148 ± 0.009 Å |
c | 12.262 ± 0.005 Å |
α | 90° |
β | 91.982 ± 0.005° |
γ | 90° |
Cell volume | 4703 ± 3 Å3 |
Cell temperature | 203 ± 2 K |
Ambient diffraction temperature | 203 ± 2 K |
Number of distinct elements | 7 |
Space group number | 14 |
Hermann-Mauguin space group symbol | P 1 21/c 1 |
Hall space group symbol | -P 2ybc |
Residual factor for all reflections | 0.0524 |
Residual factor for significantly intense reflections | 0.0445 |
Weighted residual factors for significantly intense reflections | 0.125 |
Weighted residual factors for all reflections included in the refinement | 0.1323 |
Goodness-of-fit parameter for all reflections included in the refinement | 1.028 |
Diffraction radiation wavelength | 0.71073 Å |
Diffraction radiation type | MoKα |