Information card for entry 4324456
Formula | C27 H24 B F10 P |
Calculated formula | C27 H24 B F10 P |
SMILES | [P]1(C(C)(C)C)(C(C)(C)C)Cc2ccccc2[B]1(c1c(F)c(F)c(F)c(F)c1F)c1c(F)c(F)c(F)c(F)c1F |
Title of publication | Synthesis and Reactivity of o-Benzylphosphino- and o-α-Methylbenzyl(N,N-dimethyl)amine-Boranes |
Authors of publication | Zachariah M. Heiden; Michael Schedler; Douglas W. Stephan |
Journal of publication | Inorganic Chemistry |
Year of publication | 2011 |
Journal volume | 50 |
Pages of publication | 1470 - 1479 |
a | 9.4512 ± 0.0004 Å |
b | 9.7356 ± 0.0004 Å |
c | 14.8664 ± 0.0006 Å |
α | 104.577 ± 0.002° |
β | 90.362 ± 0.002° |
γ | 99.947 ± 0.002° |
Cell volume | 1302.19 ± 0.09 Å3 |
Cell temperature | 296 ± 2 K |
Ambient diffraction temperature | 296 ± 2 K |
Number of distinct elements | 5 |
Space group number | 2 |
Hermann-Mauguin space group symbol | P -1 |
Hall space group symbol | -P 1 |
Residual factor for all reflections | 0.1156 |
Residual factor for significantly intense reflections | 0.0486 |
Weighted residual factors for significantly intense reflections | 0.1299 |
Weighted residual factors for all reflections included in the refinement | 0.1696 |
Goodness-of-fit parameter for all reflections included in the refinement | 0.878 |
Diffraction radiation wavelength | 0.71073 Å |
Diffraction radiation type | MoKα |