Information card for entry 4325076
Formula | C74 H65.84 Br2.17 N10 Ni2 O6 P2 |
Calculated formula | C74 H65.8348 Br2.1652 N10 Ni2 O6 P2 |
Title of publication | New Dinuclear Nickel(II) Complexes: Synthesis, Structure, Electrochemical, and Magnetic Properties |
Authors of publication | Dmitry Yakhvarov; Ekaterina Trofimova; Oleg Sinyashin; Olga Kataeva; Yulia Budnikova; Peter Lönnecke; Evamarie Hey-Hawkins; Andreas Petr; Yulia Krupskaya; Vladislav Kataev; Rüdiger Klingeler; Bernd Büchner |
Journal of publication | Inorganic Chemistry |
Year of publication | 2011 |
Journal volume | 50 |
Pages of publication | 4553 - 4558 |
a | 13.5067 ± 0.0005 Å |
b | 21.2589 ± 0.0006 Å |
c | 12.1901 ± 0.0004 Å |
α | 90° |
β | 103.476 ± 0.004° |
γ | 90° |
Cell volume | 3403.9 ± 0.2 Å3 |
Cell temperature | 130 ± 2 K |
Ambient diffraction temperature | 130 ± 2 K |
Number of distinct elements | 7 |
Space group number | 14 |
Hermann-Mauguin space group symbol | P 1 21/c 1 |
Hall space group symbol | -P 2ybc |
Residual factor for all reflections | 0.0601 |
Residual factor for significantly intense reflections | 0.0305 |
Weighted residual factors for significantly intense reflections | 0.0618 |
Weighted residual factors for all reflections included in the refinement | 0.0646 |
Goodness-of-fit parameter for all reflections included in the refinement | 0.851 |
Diffraction radiation wavelength | 0.71073 Å |
Diffraction radiation type | MoKα |