Information card for entry 4325592
Formula | C70 H77 F30 Fe K2 O17 |
Calculated formula | C64 H63 F30 Fe K2 O17 |
Title of publication | Synthesis with Structural and Electronic Characterization of Homoleptic Fe(II)- and Fe(III)-Fluorinated Phenolate Complexes |
Authors of publication | Stefanie A. Cantalupo; Helen E. Ferreira; Eman Bataineh; Annie J. King; Montana V. Petersen; Teresa Wojtasiewicz; Antonio G. DiPasquale; Arnold L. Rheingold; Linda H. Doerrer |
Journal of publication | Inorganic Chemistry |
Year of publication | 2011 |
Journal volume | 50 |
Pages of publication | 6584 - 6596 |
a | 14.0618 ± 0.0015 Å |
b | 14.3821 ± 0.0015 Å |
c | 21.326 ± 0.002 Å |
α | 88.796 ± 0.002° |
β | 74.063 ± 0.002° |
γ | 89.938 ± 0.002° |
Cell volume | 4146.2 ± 0.7 Å3 |
Cell temperature | 100 ± 2 K |
Ambient diffraction temperature | 100 ± 2 K |
Number of distinct elements | 6 |
Space group number | 2 |
Hermann-Mauguin space group symbol | P -1 |
Hall space group symbol | -P 1 |
Residual factor for all reflections | 0.102 |
Residual factor for significantly intense reflections | 0.0801 |
Weighted residual factors for significantly intense reflections | 0.234 |
Weighted residual factors for all reflections included in the refinement | 0.2561 |
Goodness-of-fit parameter for all reflections included in the refinement | 1.144 |
Diffraction radiation wavelength | 0.71073 Å |
Diffraction radiation type | MoKα |