Information card for entry 4327083
Formula | C20 H17 O7.98 Re |
Calculated formula | C20 H17 O7.978 Re |
Title of publication | Tuning the Reactivity in Classic Low-Spin d6 Rhenium(I) Tricarbonyl Radiopharmaceutical Synthon by Selective Bidentate Ligand Variation (L,L'-Bid; L,L'=N,N', N,O, and O,O' Donor Atom Sets) in fac-[Re(CO)3(L,L'-Bid)(MeOH)]n Complexes |
Authors of publication | Marietjie Schutte; Gerdus Kemp; Hendrik G. Visser; Andreas Roodt |
Journal of publication | Inorganic Chemistry |
Year of publication | 2011 |
Journal volume | 50 |
Pages of publication | 12486 - 12498 |
a | 7.551 ± 0.005 Å |
b | 9.768 ± 0.005 Å |
c | 13.373 ± 0.005 Å |
α | 94.173 ± 0.005° |
β | 95.504 ± 0.005° |
γ | 102.569 ± 0.005° |
Cell volume | 953.8 ± 0.9 Å3 |
Cell temperature | 273 ± 2 K |
Ambient diffraction temperature | 273 ± 2 K |
Number of distinct elements | 4 |
Space group number | 2 |
Hermann-Mauguin space group symbol | P -1 |
Hall space group symbol | -P 1 |
Residual factor for all reflections | 0.0356 |
Residual factor for significantly intense reflections | 0.0285 |
Weighted residual factors for significantly intense reflections | 0.0655 |
Weighted residual factors for all reflections included in the refinement | 0.0733 |
Goodness-of-fit parameter for all reflections included in the refinement | 1.061 |
Diffraction radiation wavelength | 0.71073 Å |
Diffraction radiation type | MoKα |