Information card for entry 4327097
Formula | C86 H116 B2 Cl9.12 Ga4 I4.88 N14 S6 |
Calculated formula | C86 H116 B2 Cl9.124 Ga4 I4.876 N14 S6 |
Title of publication | Synthesis and Structural Characterization of Tris(2-mercapto-1-adamantylimidazolyl)hydroborato Complexes: A Sterically Demanding Tripodal [S3] Donor Ligand |
Authors of publication | Kevin Yurkerwich; Michael Yurkerwich; Gerard Parkin |
Journal of publication | Inorganic Chemistry |
Year of publication | 2011 |
Journal volume | 50 |
Pages of publication | 12284 - 12295 |
a | 12.861 ± 0.004 Å |
b | 14.191 ± 0.004 Å |
c | 15.9 ± 0.005 Å |
α | 78.766 ± 0.004° |
β | 80.164 ± 0.004° |
γ | 70.775 ± 0.004° |
Cell volume | 2669.7 ± 1.4 Å3 |
Cell temperature | 170 ± 2 K |
Ambient diffraction temperature | 170 ± 2 K |
Number of distinct elements | 8 |
Space group number | 2 |
Hermann-Mauguin space group symbol | P -1 |
Hall space group symbol | -P 1 |
Residual factor for all reflections | 0.1916 |
Residual factor for significantly intense reflections | 0.07 |
Weighted residual factors for significantly intense reflections | 0.1536 |
Weighted residual factors for all reflections included in the refinement | 0.1981 |
Goodness-of-fit parameter for all reflections included in the refinement | 1.002 |
Diffraction radiation wavelength | 0.71073 Å |
Diffraction radiation type | MoKα |