Information card for entry 4327137
Formula | C30 H58 N4 O |
Calculated formula | C30 H58 N4 O |
Title of publication | New Volatile Strontium and Barium Imidazolate Complexes for the Deposition of Group 2 Metal Oxides |
Authors of publication | John A. T. Norman; Melanie Perez; M. S. Kim; Xinjian Lei; Sergei Ivanov; Agnes Derecskei-Kovacs; Laura Matz; Iain Buchanan; Arnold L. Rheingold |
Journal of publication | Inorganic Chemistry |
Year of publication | 2011 |
Journal volume | 50 |
Pages of publication | 12396 - 12398 |
a | 11.529 ± 0.003 Å |
b | 18.656 ± 0.005 Å |
c | 14.69 ± 0.004 Å |
α | 90° |
β | 94.713 ± 0.008° |
γ | 90° |
Cell volume | 3148.9 ± 1.5 Å3 |
Cell temperature | 100 ± 2 K |
Ambient diffraction temperature | 100 ± 2 K |
Number of distinct elements | 4 |
Space group number | 14 |
Hermann-Mauguin space group symbol | P 1 21/c 1 |
Hall space group symbol | -P 2ybc |
Residual factor for all reflections | 0.1293 |
Residual factor for significantly intense reflections | 0.0747 |
Weighted residual factors for significantly intense reflections | 0.1628 |
Weighted residual factors for all reflections included in the refinement | 0.1899 |
Goodness-of-fit parameter for all reflections included in the refinement | 1.022 |
Diffraction radiation wavelength | 0.71073 Å |
Diffraction radiation type | MoKα |