Information card for entry 4327198
Formula | C40 H41 B N2 |
Calculated formula | C40 H41 B N2 |
Title of publication | Incorporation of Amphiphilic Ruthenium(II) Ammine Complexes into Langmuir-Blodgett Thin Films with Switchable Quadratic Nonlinear Optical Behavior |
Authors of publication | Leïla Boubekeur-Lecaque; Benjamin J. Coe; James A. Harris; Madeleine Helliwell; Inge Asselberghs; Koen Clays; Stijn Foerier; Thierry Verbiest |
Journal of publication | Inorganic Chemistry |
Year of publication | 2011 |
Journal volume | 50 |
Pages of publication | 12886 - 12899 |
a | 11.5743 ± 0.0006 Å |
b | 17.6392 ± 0.001 Å |
c | 16.0109 ± 0.0009 Å |
α | 90° |
β | 100.99 ± 0.001° |
γ | 90° |
Cell volume | 3208.9 ± 0.3 Å3 |
Cell temperature | 100 ± 2 K |
Ambient diffraction temperature | 100 ± 2 K |
Number of distinct elements | 4 |
Space group number | 14 |
Hermann-Mauguin space group symbol | P 1 21/n 1 |
Hall space group symbol | -P 2yn |
Residual factor for all reflections | 0.0497 |
Residual factor for significantly intense reflections | 0.0365 |
Weighted residual factors for significantly intense reflections | 0.0937 |
Weighted residual factors for all reflections included in the refinement | 0.0972 |
Goodness-of-fit parameter for all reflections included in the refinement | 1.037 |
Diffraction radiation wavelength | 0.71073 Å |
Diffraction radiation type | MoKα |