Information card for entry 4327200
Formula | C128 H270 Cl12 N28 O15 Ru4 |
Calculated formula | C128 H240 Cl12 N28 O15 Ru4 |
Title of publication | Incorporation of Amphiphilic Ruthenium(II) Ammine Complexes into Langmuir-Blodgett Thin Films with Switchable Quadratic Nonlinear Optical Behavior |
Authors of publication | Leïla Boubekeur-Lecaque; Benjamin J. Coe; James A. Harris; Madeleine Helliwell; Inge Asselberghs; Koen Clays; Stijn Foerier; Thierry Verbiest |
Journal of publication | Inorganic Chemistry |
Year of publication | 2011 |
Journal volume | 50 |
Pages of publication | 12886 - 12899 |
a | 9.55 ± 0.003 Å |
b | 13.767 ± 0.005 Å |
c | 31.619 ± 0.01 Å |
α | 89.948 ± 0.004° |
β | 84.223 ± 0.004° |
γ | 89.51 ± 0.003° |
Cell volume | 4136 ± 2 Å3 |
Cell temperature | 100 ± 2 K |
Ambient diffraction temperature | 100 ± 2 K |
Number of distinct elements | 6 |
Space group number | 2 |
Hermann-Mauguin space group symbol | P -1 |
Hall space group symbol | -P 1 |
Residual factor for all reflections | 0.1374 |
Residual factor for significantly intense reflections | 0.0814 |
Weighted residual factors for significantly intense reflections | 0.1861 |
Weighted residual factors for all reflections included in the refinement | 0.2111 |
Goodness-of-fit parameter for all reflections included in the refinement | 1.023 |
Diffraction radiation wavelength | 0.671 Å |
Diffraction radiation type | synchrotron |