Information card for entry 4327209
Common name | (NEt4)2[Fe2(mu-NtBu)2Cl4] |
Formula | C24 H58 Cl4 Fe2 N4 |
Calculated formula | C24 H58 Cl4 Fe2 N4 |
SMILES | C(C)(C)(C)N1[Fe]2(Cl)(N(C(C)(C)C)[Fe]12(Cl)Cl)Cl.C(C)[N+](CC)(CC)CC.C(C)[N+](CC)(CC)CC |
Title of publication | Synthesis and Elaboration of the Dinuclear Iron-Imide Cluster Core [Fe2(μ-NR)2]2+ |
Authors of publication | Jeremiah S. Duncan; Michael J. Zdilla; Sonny C. Lee |
Journal of publication | Inorganic Chemistry |
Year of publication | 2007 |
Journal volume | 46 |
Pages of publication | 1071 - 1080 |
a | 12.002 ± 0.0009 Å |
b | 11.5142 ± 0.0006 Å |
c | 12.5742 ± 0.001 Å |
α | 90° |
β | 94.769 ± 0.002° |
γ | 90° |
Cell volume | 1731.7 ± 0.2 Å3 |
Cell temperature | 200 ± 2 K |
Ambient diffraction temperature | 200 ± 2 K |
Number of distinct elements | 5 |
Space group number | 14 |
Hermann-Mauguin space group symbol | P 1 21/n 1 |
Hall space group symbol | -P 2yn |
Residual factor for all reflections | 0.1285 |
Residual factor for significantly intense reflections | 0.0564 |
Weighted residual factors for all reflections | 0.1671 |
Weighted residual factors for significantly intense reflections | 0.1311 |
Goodness-of-fit parameter for all reflections | 0.991 |
Goodness-of-fit parameter for significantly intense reflections | 1.06 |
Diffraction radiation wavelength | 0.71073 Å |
Diffraction radiation type | MoKα |