Information card for entry 4327255
Common name | Co(DH)2(4-t-BuPy) |
Formula | C17 H27 Co N5 O4 |
Calculated formula | C17 H27 Co N5 O4 |
Title of publication | Syntheses and Characterization of Organo-Group 14 Cobaloxime Compounds |
Authors of publication | Alan M. Stolzenberg; Sarah R. Workman; Jessica E. Gutshall; Jeffrey L. Petersen; Novruz Akhmedov |
Journal of publication | Inorganic Chemistry |
Year of publication | 2007 |
Journal volume | 46 |
Pages of publication | 6744 - 6754 |
a | 17.9821 ± 0.0011 Å |
b | 9.7449 ± 0.0006 Å |
c | 22.7374 ± 0.0015 Å |
α | 90° |
β | 90° |
γ | 90° |
Cell volume | 3984.4 ± 0.4 Å3 |
Cell temperature | 295 ± 2 K |
Ambient diffraction temperature | 295 ± 2 K |
Number of distinct elements | 5 |
Space group number | 60 |
Hermann-Mauguin space group symbol | P b c n |
Hall space group symbol | -P 2n 2ab |
Residual factor for all reflections | 0.0579 |
Residual factor for significantly intense reflections | 0.043 |
Weighted residual factors for significantly intense reflections | 0.1099 |
Weighted residual factors for all reflections included in the refinement | 0.123 |
Goodness-of-fit parameter for all reflections included in the refinement | 1.035 |
Diffraction radiation probe | x-ray |
Diffraction radiation wavelength | 0.71073 Å |
Diffraction radiation type | MoKα |