Information card for entry 4327257
Common name | (4-t-BuPy)Co(DH)2(PbPh3) |
Formula | C35 H42 Co N5 O4 Pb |
Calculated formula | C35 H42 Co N5 O4 Pb |
Title of publication | Syntheses and Characterization of Organo-Group 14 Cobaloxime Compounds |
Authors of publication | Alan M. Stolzenberg; Sarah R. Workman; Jessica E. Gutshall; Jeffrey L. Petersen; Novruz Akhmedov |
Journal of publication | Inorganic Chemistry |
Year of publication | 2007 |
Journal volume | 46 |
Pages of publication | 6744 - 6754 |
a | 15.0104 ± 0.0007 Å |
b | 15.7693 ± 0.0008 Å |
c | 16.623 ± 0.0008 Å |
α | 90° |
β | 114.348 ± 0.001° |
γ | 90° |
Cell volume | 3584.8 ± 0.3 Å3 |
Cell temperature | 295 ± 2 K |
Ambient diffraction temperature | 295 ± 2 K |
Number of distinct elements | 6 |
Space group number | 14 |
Hermann-Mauguin space group symbol | P 1 21/n 1 |
Hall space group symbol | -P 2yn |
Residual factor for all reflections | 0.0358 |
Residual factor for significantly intense reflections | 0.0251 |
Weighted residual factors for significantly intense reflections | 0.0549 |
Weighted residual factors for all reflections included in the refinement | 0.0582 |
Goodness-of-fit parameter for all reflections included in the refinement | 1.014 |
Diffraction radiation probe | x-ray |
Diffraction radiation wavelength | 0.71073 Å |
Diffraction radiation type | MoKα |