Information card for entry 4328807
Chemical name | Dicaesium triplatinum(II) uranium(IV) selenide |
Formula | Cs2 Pt3 Se6 U |
Calculated formula | Cs2 Pt3 Se6 U |
Title of publication | Syntheses and Characterization of Nine Quaternary Uranium Chalcogenides Among the Compounds A2M3UQ6 (A = K, Rb, Cs; M = Pd, Pt; Q = S, Se) |
Authors of publication | George N. Oh; Eun Sang Choi; James A. Ibers |
Journal of publication | Inorganic Chemistry |
Year of publication | 2012 |
Journal volume | 51 |
Pages of publication | 4224 - 4230 |
a | 10.0904 ± 0.0005 Å |
b | 15.3859 ± 0.0007 Å |
c | 17.5882 ± 0.0008 Å |
α | 90° |
β | 90° |
γ | 90° |
Cell volume | 2730.6 ± 0.2 Å3 |
Cell temperature | 100 ± 2 K |
Ambient diffraction temperature | 100 ± 2 K |
Number of distinct elements | 4 |
Space group number | 69 |
Hermann-Mauguin space group symbol | F m m m |
Hall space group symbol | -F 2 2 |
Residual factor for all reflections | 0.0222 |
Residual factor for significantly intense reflections | 0.0198 |
Weighted residual factors for significantly intense reflections | 0.0386 |
Weighted residual factors for all reflections included in the refinement | 0.0391 |
Goodness-of-fit parameter for all reflections included in the refinement | 1.282 |
Diffraction radiation wavelength | 0.71073 Å |
Diffraction radiation type | MoKα |