Information card for entry 4328815
Chemical name | Dipotassium tripalladium(II) uranium(IV) sulfide |
Formula | K2 Pd3 S6 U |
Calculated formula | K2 Pd3 S6 U |
Title of publication | Syntheses and Characterization of Nine Quaternary Uranium Chalcogenides Among the Compounds A2M3UQ6 (A = K, Rb, Cs; M = Pd, Pt; Q = S, Se) |
Authors of publication | George N. Oh; Eun Sang Choi; James A. Ibers |
Journal of publication | Inorganic Chemistry |
Year of publication | 2012 |
Journal volume | 51 |
Pages of publication | 4224 - 4230 |
a | 9.7256 ± 0.0005 Å |
b | 13.8721 ± 0.0006 Å |
c | 16.7541 ± 0.0008 Å |
α | 90° |
β | 90° |
γ | 90° |
Cell volume | 2260.37 ± 0.19 Å3 |
Cell temperature | 89 ± 2 K |
Ambient diffraction temperature | 89 ± 2 K |
Number of distinct elements | 4 |
Space group number | 69 |
Hermann-Mauguin space group symbol | F m m m |
Hall space group symbol | -F 2 2 |
Residual factor for all reflections | 0.0513 |
Residual factor for significantly intense reflections | 0.0501 |
Weighted residual factors for significantly intense reflections | 0.1315 |
Weighted residual factors for all reflections included in the refinement | 0.1327 |
Goodness-of-fit parameter for all reflections included in the refinement | 1.097 |
Diffraction radiation wavelength | 0.71073 Å |
Diffraction radiation type | MoKα |