Information card for entry 4328967
Formula | Ba8 Ni3.7 Si41.4 |
Calculated formula | Ba8 Ni3.702 Si41.41 |
Title of publication | Synthesis, Crystal Structure, and Physical Properties of the Type-I Clathrate Ba8-δNix( )ySi46-x-y |
Authors of publication | U. Aydemir; C. Candolfi; A. Ormeci; H. Borrmann; U. Burkhardt; Y. Oztan; N. Oeschler; M. Baitinger; F. Steglich; Yu. Grin |
Journal of publication | Inorganic Chemistry |
Year of publication | 2012 |
Journal volume | 51 |
Pages of publication | 4730 - 4741 |
a | 10.2906 ± 0.0001 Å |
b | 10.2906 ± 0.0001 Å |
c | 10.2906 ± 0.0001 Å |
α | 90° |
β | 90° |
γ | 90° |
Cell volume | 1089.74 ± 0.018 Å3 |
Cell temperature | 295 ± 2 K |
Ambient diffraction temperature | 295 ± 2 K |
Number of distinct elements | 3 |
Space group number | 223 |
Hermann-Mauguin space group symbol | P m -3 n |
Hall space group symbol | -P 4n 2 3 |
Residual factor for all reflections | 0.0289 |
Residual factor for significantly intense reflections | 0.0214 |
Weighted residual factors for all reflections | 0.0589 |
Weighted residual factors for all reflections included in the refinement | 0.0353 |
Goodness-of-fit parameter for all reflections included in the refinement | 1.45 |
Diffraction radiation probe | x-ray |
Diffraction radiation wavelength | 0.56087 Å |
Diffraction radiation type | AgKα |