Information card for entry 4328996
Formula | C4 H12 Cl2 Co N20 |
Calculated formula | C4 H12 Cl2 Co N20 |
SMILES | c1([nH]nn[n]1[Co]([n]1c([nH]nn1)N)([n]1c([nH]nn1)N)([n]1c([nH]nn1)N)(Cl)Cl)N |
Title of publication | Two Acentric Mononuclear Molecular Complexes with Unusual Magnetic and Ferroelectric Properties |
Authors of publication | Fang-Hua Zhao; Yun-Xia Che; Ji-Min Zheng; Fernande Grandjean; Gary J. Long |
Journal of publication | Inorganic Chemistry |
Year of publication | 2012 |
Journal volume | 51 |
Pages of publication | 4862 - 4868 |
a | 9.7393 ± 0.0014 Å |
b | 9.7393 ± 0.0014 Å |
c | 8.4141 ± 0.0017 Å |
α | 90° |
β | 90° |
γ | 90° |
Cell volume | 798.1 ± 0.2 Å3 |
Cell temperature | 153 ± 2 K |
Ambient diffraction temperature | 153 ± 2 K |
Number of distinct elements | 5 |
Space group number | 104 |
Hermann-Mauguin space group symbol | P 4 n c |
Hall space group symbol | P 4 -2n |
Residual factor for all reflections | 0.0218 |
Residual factor for significantly intense reflections | 0.0204 |
Weighted residual factors for significantly intense reflections | 0.0588 |
Weighted residual factors for all reflections included in the refinement | 0.0597 |
Goodness-of-fit parameter for all reflections included in the refinement | 1.002 |
Diffraction radiation wavelength | 0.71073 Å |
Diffraction radiation type | MoKα |