Information card for entry 4329199
Formula | C36 H27 Co N11 Re S6 |
Calculated formula | C36 H25 Co N11 Re S6 |
Title of publication | New Family of Thiocyanate-Bridged Re(IV)-SCN-M(II) (M = Ni, Co, Fe, and Mn) Heterobimetallic Compounds: Synthesis, Crystal Structure, and Magnetic Properties |
Authors of publication | Ricardo González; Alvaro Acosta; Raúl Chiozzone; Carlos Kremer; Donatella Armentano; Giovanni De Munno; Miguel Julve; Francesc Lloret; Juan Faus |
Journal of publication | Inorganic Chemistry |
Year of publication | 2012 |
Journal volume | 51 |
Pages of publication | 5737 - 5747 |
a | 23.105 ± 0.005 Å |
b | 12.151 ± 0.002 Å |
c | 32.372 ± 0.007 Å |
α | 90° |
β | 106.21 ± 0.03° |
γ | 90° |
Cell volume | 8727 ± 3 Å3 |
Cell temperature | 293 ± 2 K |
Ambient diffraction temperature | 293 ± 2 K |
Number of distinct elements | 6 |
Space group number | 15 |
Hermann-Mauguin space group symbol | C 1 2/c 1 |
Hall space group symbol | -C 2yc |
Residual factor for all reflections | 0.1785 |
Residual factor for significantly intense reflections | 0.1136 |
Weighted residual factors for significantly intense reflections | 0.2558 |
Weighted residual factors for all reflections included in the refinement | 0.2871 |
Goodness-of-fit parameter for all reflections included in the refinement | 1.397 |
Diffraction radiation wavelength | 0.71073 Å |