Information card for entry 4330404
Formula | C4 H30 I N2 O24 P8 Pt2 Rb2 |
Calculated formula | C4 H10 I N2 O24 P8 Pt2 Rb2 |
Title of publication | Controlling the Electronic States and Physical Properties of MMX-Type Diplatinum-Iodide Chain Complexes via Binary Countercations |
Authors of publication | Hiroaki Iguchi; Shinya Takaishi; Brian K. Breedlove; Masahiro Yamashita; Hiroyuki Matsuzaki; Hiroshi Okamoto |
Journal of publication | Inorganic Chemistry |
Year of publication | 2012 |
Journal volume | 51 |
Pages of publication | 9967 - 9977 |
a | 13.5079 ± 0.0011 Å |
b | 13.5079 ± 0.0011 Å |
c | 17.531 ± 0.002 Å |
α | 90° |
β | 90° |
γ | 90° |
Cell volume | 3198.8 ± 0.5 Å3 |
Cell temperature | 100 ± 2 K |
Ambient diffraction temperature | 100 ± 2 K |
Number of distinct elements | 8 |
Space group number | 104 |
Hermann-Mauguin space group symbol | P 4 n c |
Hall space group symbol | P 4 -2n |
Residual factor for all reflections | 0.0536 |
Residual factor for significantly intense reflections | 0.026 |
Weighted residual factors for significantly intense reflections | 0.0423 |
Weighted residual factors for all reflections included in the refinement | 0.0455 |
Goodness-of-fit parameter for all reflections included in the refinement | 0.715 |
Diffraction radiation wavelength | 0.71073 Å |
Diffraction radiation type | MoKα |