Information card for entry 4330798
Formula | P16 Se1.53 Si30 Te6.47 |
Calculated formula | P16 Se1.532 Si30 Te6.468 |
Title of publication | Homo- and Heterovalent Substitutions in the New Clathrates I Si30P16Te8-xSex and Si30+xP16-xTe8-xBrx: Synthesis, Crystal Structure, and Thermoelectric Properties |
Authors of publication | Nikolay S. Abramchuk; Wilder Carrillo-Cabrera; Igor Veremchuk; Niels Oeschler; Andrei V. Olenev; Yurii Prots; Ulrich Burkhardt; Evgeny V. Dikarev; Yuri Grin; Andrei V. Shevelkov |
Journal of publication | Inorganic Chemistry |
Year of publication | 2012 |
Journal volume | 51 |
Pages of publication | 11396 - 11405 |
a | 9.929 ± 0.001 Å |
b | 9.929 ± 0.001 Å |
c | 9.929 ± 0.001 Å |
α | 90° |
β | 90° |
γ | 90° |
Cell volume | 978.85 ± 0.17 Å3 |
Cell temperature | 298 K |
Ambient diffraction temperature | 298 K |
Number of distinct elements | 4 |
Space group number | 223 |
Hermann-Mauguin space group symbol | P m -3 n |
Hall space group symbol | -P 4n 2 3 |
Residual factor for all reflections | 0.0412 |
Residual factor for significantly intense reflections | 0.0325 |
Weighted residual factors for significantly intense reflections | 0.0696 |
Weighted residual factors for all reflections included in the refinement | 0.0725 |
Goodness-of-fit parameter for all reflections included in the refinement | 1.219 |
Diffraction radiation wavelength | 0.71073 Å |
Diffraction radiation type | MoKα |