Information card for entry 4330810
Formula | Br5.01 P9.61 Si36.39 Te2.3 |
Calculated formula | Br5.02 P16 Si30 Te2.286 |
Title of publication | Homo- and Heterovalent Substitutions in the New Clathrates I Si30P16Te8-xSex and Si30+xP16-xTe8-xBrx: Synthesis, Crystal Structure, and Thermoelectric Properties |
Authors of publication | Nikolay S. Abramchuk; Wilder Carrillo-Cabrera; Igor Veremchuk; Niels Oeschler; Andrei V. Olenev; Yurii Prots; Ulrich Burkhardt; Evgeny V. Dikarev; Yuri Grin; Andrei V. Shevelkov |
Journal of publication | Inorganic Chemistry |
Year of publication | 2012 |
Journal volume | 51 |
Pages of publication | 11396 - 11405 |
a | 10.034 ± 0.0004 Å |
b | 10.034 ± 0.0004 Å |
c | 10.034 ± 0.0004 Å |
α | 90° |
β | 90° |
γ | 90° |
Cell volume | 1010.23 ± 0.07 Å3 |
Cell temperature | 298 K |
Ambient diffraction temperature | 298 K |
Number of distinct elements | 4 |
Space group number | 223 |
Hermann-Mauguin space group symbol | P m -3 n |
Hall space group symbol | -P 4n 2 3 |
Residual factor for all reflections | 0.0232 |
Residual factor for significantly intense reflections | 0.0232 |
Weighted residual factors for significantly intense reflections | 0.0614 |
Weighted residual factors for all reflections included in the refinement | 0.0614 |
Goodness-of-fit parameter for all reflections included in the refinement | 1.618 |
Diffraction radiation wavelength | 0.71073 Å |
Diffraction radiation type | MoKα |