Information card for entry 4332466
Formula | C47.5 H67 Cl2 Fe2 Mn2 N13 O13 |
Calculated formula | C47.5 H64 Cl2 Fe2 Mn2 N13 O13 |
Title of publication | Deliberate Synthesis for Magnetostructural Study of Linear Tetranuclear Complexes BIIIMnIIMnIIBIII, MnIIIMnIIMnIIMnIII, MnIVMnIIMnIIMnIV, FeIIIMnIIMnIIFeIII, and CrIIIMnIIMnIICrIII. Influence of Terminal Ions on the Exchange Coupling |
Authors of publication | Khanra, Sumit; Weyhermüller, Thomas; Bill, Eckhard; Chaudhuri, Phalguni |
Journal of publication | Inorganic Chemistry |
Year of publication | 2006 |
Journal volume | 45 |
Journal issue | 15 |
Pages of publication | 5911 - 5923 |
a | 14.4112 ± 0.0004 Å |
b | 16.6991 ± 0.0006 Å |
c | 25.0197 ± 0.0008 Å |
α | 90° |
β | 104.819 ± 0.004° |
γ | 90° |
Cell volume | 5820.8 ± 0.3 Å3 |
Cell temperature | 100 ± 2 K |
Ambient diffraction temperature | 100 ± 2 K |
Number of distinct elements | 7 |
Space group number | 14 |
Hermann-Mauguin space group symbol | P 1 21/c 1 |
Hall space group symbol | -P 2ybc |
Residual factor for all reflections | 0.0856 |
Residual factor for significantly intense reflections | 0.0527 |
Weighted residual factors for all reflections | 0.1494 |
Weighted residual factors for significantly intense reflections | 0.1263 |
Goodness-of-fit parameter for all reflections | 1.012 |
Goodness-of-fit parameter for significantly intense reflections | 1.076 |
Diffraction radiation wavelength | 0.71073 Å |
Diffraction radiation type | MoKα |