Information card for entry 4332954
Formula | C8 H20 I In N2 S2 |
Calculated formula | C8 H20 I In N2 S2 |
SMILES | I[In]12(SCC[N]1(C)C)SCC[N]2(C)C |
Title of publication | Preferred Bonding Motif for Indium Aminoethanethiolate Complexes: Structural Characterization of (Me2NCH2CH2S)2InX/SR (X = Cl, I; R = 4-MeC6H4, 4-MeOC6H4) |
Authors of publication | Briand, Glen G.; Cooper, Benjamin F. T.; MacDonald, David B. S.; Martin, Caleb D.; Schatte, Gabriele |
Journal of publication | Inorganic Chemistry |
Year of publication | 2006 |
Journal volume | 45 |
Journal issue | 20 |
Pages of publication | 8423 - 8429 |
a | 10.864 ± 0.0003 Å |
b | 9.686 ± 0.0003 Å |
c | 17.247 ± 0.0003 Å |
α | 90° |
β | 126.348 ± 0.0014° |
γ | 90° |
Cell volume | 1461.76 ± 0.07 Å3 |
Cell temperature | 173 ± 2 K |
Ambient diffraction temperature | 173 ± 2 K |
Number of distinct elements | 6 |
Space group number | 14 |
Hermann-Mauguin space group symbol | P 1 21/c 1 |
Hall space group symbol | -P 2ybc |
Residual factor for all reflections | 0.0468 |
Residual factor for significantly intense reflections | 0.0304 |
Weighted residual factors for significantly intense reflections | 0.0627 |
Weighted residual factors for all reflections included in the refinement | 0.0703 |
Goodness-of-fit parameter for all reflections included in the refinement | 1.065 |
Diffraction radiation wavelength | 0.71073 Å |
Diffraction radiation type | MoKα |