Information card for entry 4333260
Formula | C11 H9 Cl2 N5 Zn |
Calculated formula | C11 H9 Cl2 N5 Zn |
Title of publication | Conformational Effect of 2,6-Bis(imidazol-1-yl)pyridine on the Self-Assembly of 1D Coordination Chains: Spontaneous Resolution, Supramolecular Isomerism, and Structural Transformation |
Authors of publication | Chen, Chih-Yuan; Cheng, Pi-Yun; Wu, Hsin-Hsuan; Lee, Hon Man |
Journal of publication | Inorganic Chemistry |
Year of publication | 2007 |
Journal volume | 46 |
Journal issue | 14 |
Pages of publication | 5691 - 5699 |
a | 9.4515 ± 0.0005 Å |
b | 14.2276 ± 0.0008 Å |
c | 20.1329 ± 0.0011 Å |
α | 90° |
β | 90° |
γ | 90° |
Cell volume | 2707.3 ± 0.3 Å3 |
Cell temperature | 150 ± 2 K |
Ambient diffraction temperature | 150 ± 2 K |
Number of distinct elements | 5 |
Space group number | 61 |
Hermann-Mauguin space group symbol | P b c a |
Hall space group symbol | -P 2ac 2ab |
Residual factor for all reflections | 0.0268 |
Residual factor for significantly intense reflections | 0.0222 |
Weighted residual factors for significantly intense reflections | 0.0593 |
Weighted residual factors for all reflections included in the refinement | 0.0611 |
Goodness-of-fit parameter for all reflections included in the refinement | 1.036 |
Diffraction radiation probe | x-ray |
Diffraction radiation wavelength | 0.71073 Å |
Diffraction radiation type | MoKα |