Information card for entry 4333328
Chemical name | Potassium uranyl sulfate hydroxide |
Formula | H K O7 S U |
Calculated formula | H K O7 S U |
Title of publication | Structure determination and infrared spectroscopy of K(UO2)(SO4)(OH)(H2O) and K(UO2)(SO4)(OH). |
Authors of publication | Forbes, Tori Z.; Goss, Valerie; Jain, Meha; Burns, Peter C. |
Journal of publication | Inorganic chemistry |
Year of publication | 2007 |
Journal volume | 46 |
Journal issue | 17 |
Pages of publication | 7163 - 7168 |
a | 8.4451 ± 0.0002 Å |
b | 10.8058 ± 0.0004 Å |
c | 13.5406 ± 0.0005 Å |
α | 90° |
β | 90° |
γ | 90° |
Cell volume | 1235.66 ± 0.07 Å3 |
Cell temperature | 293 ± 2 K |
Ambient diffraction temperature | 293 ± 2 K |
Number of distinct elements | 5 |
Space group number | 61 |
Hermann-Mauguin space group symbol | P b c a |
Hall space group symbol | -P 2ac 2ab |
Residual factor for all reflections | 0.0236 |
Residual factor for significantly intense reflections | 0.0206 |
Weighted residual factors for significantly intense reflections | 0.0479 |
Weighted residual factors for all reflections included in the refinement | 0.0489 |
Goodness-of-fit parameter for all reflections included in the refinement | 1.148 |
Diffraction radiation probe | x-ray |
Diffraction radiation wavelength | 0.71073 Å |
Diffraction radiation type | MoKα |