Information card for entry 4333356
Formula | C50 H37 Au N3 P |
Calculated formula | C50 H37 Au N3 P |
SMILES | [Au]1([P](c2ccccc2)(c2ccccc2)c2ccccc2)[n]2c(cc(c2=Nc2n1c(c1ccccc1)cc2c1ccccc1)c1ccccc1)c1ccccc1 |
Title of publication | Luminescent, Three-Coordinate Azadipyrromethene Complexes of d10Copper, Silver, and Gold |
Authors of publication | Teets, Thomas S.; Partyka, David V.; Esswein, Arthur J.; Updegraff, James B.; Zeller, Matthias; Hunter, Allen D.; Gray, Thomas G. |
Journal of publication | Inorganic Chemistry |
Year of publication | 2007 |
Journal volume | 46 |
Journal issue | 16 |
Pages of publication | 6218 - 6220 |
a | 12.3616 ± 0.0002 Å |
b | 12.9923 ± 0.0002 Å |
c | 23.7047 ± 0.0005 Å |
α | 90° |
β | 90.678 ± 0.001° |
γ | 90° |
Cell volume | 3806.84 ± 0.12 Å3 |
Cell temperature | 100 ± 2 K |
Ambient diffraction temperature | 100 ± 2 K |
Number of distinct elements | 5 |
Space group number | 14 |
Hermann-Mauguin space group symbol | P 1 21/n 1 |
Hall space group symbol | -P 2yn |
Residual factor for all reflections | 0.018 |
Residual factor for significantly intense reflections | 0.0157 |
Weighted residual factors for significantly intense reflections | 0.0401 |
Weighted residual factors for all reflections included in the refinement | 0.0413 |
Goodness-of-fit parameter for all reflections included in the refinement | 1.009 |
Diffraction radiation wavelength | 0.71073 Å |
Diffraction radiation type | MoKα |