Information card for entry 4333427
Formula | C30 H52 O22 V4 |
Calculated formula | C30 H50 O22 V4 |
Title of publication | Synthesis, structural, and magnetic studies on a redox family of tetrametallic vanadium clusters: {VIV4}, {VIII2VIV2}, and {VIII4} butterfly complexes. |
Authors of publication | Tidmarsh, Ian S.; Scales, Emma; Brearley, Paul R.; Wolowska, Joanna; Sorace, Lorenzo; Caneschi, Andrea; Laye, Rebecca H.; McInnes, Eric J. L. |
Journal of publication | Inorganic chemistry |
Year of publication | 2007 |
Journal volume | 46 |
Journal issue | 23 |
Pages of publication | 9743 - 9753 |
a | 11.067 ± 0.008 Å |
b | 12.034 ± 0.009 Å |
c | 17.256 ± 0.013 Å |
α | 102.367 ± 0.014° |
β | 94.48 ± 0.013° |
γ | 114.203 ± 0.012° |
Cell volume | 2012 ± 3 Å3 |
Cell temperature | 100 ± 2 K |
Ambient diffraction temperature | 373 ± 2 K |
Number of distinct elements | 4 |
Space group number | 2 |
Hermann-Mauguin space group symbol | P -1 |
Hall space group symbol | -P 1 |
Residual factor for all reflections | 0.0788 |
Residual factor for significantly intense reflections | 0.0618 |
Weighted residual factors for significantly intense reflections | 0.1681 |
Weighted residual factors for all reflections included in the refinement | 0.1778 |
Goodness-of-fit parameter for all reflections included in the refinement | 1.037 |
Diffraction radiation wavelength | 0.71073 Å |
Diffraction radiation type | MoKα |