Information card for entry 4333433
Formula | C29 H26 F12 N10 P2 Ru |
Calculated formula | C29 H26 F12 N10 P2 Ru |
Title of publication | Polypyridyl ruthenium(II) complexes with tetrazolate-based chelating ligands. Synthesis, reactivity, and electrochemical and photophysical properties. |
Authors of publication | Stagni, Stefano; Orselli, Enrico; Palazzi, Antonio; De Cola, Luisa; Zacchini, Stefano; Femoni, Cristina; Marcaccio, Massimo; Paolucci, Francesco; Zanarini, Simone |
Journal of publication | Inorganic chemistry |
Year of publication | 2007 |
Journal volume | 46 |
Journal issue | 22 |
Pages of publication | 9126 - 9138 |
a | 9.701 ± 0.0008 Å |
b | 13.6667 ± 0.0011 Å |
c | 14.0902 ± 0.0011 Å |
α | 81.451 ± 0.001° |
β | 71.487 ± 0.001° |
γ | 89.522 ± 0.001° |
Cell volume | 1750.2 ± 0.2 Å3 |
Cell temperature | 298 ± 2 K |
Ambient diffraction temperature | 273 ± 2 K |
Number of distinct elements | 6 |
Space group number | 2 |
Hermann-Mauguin space group symbol | P -1 |
Hall space group symbol | -P 1 |
Residual factor for all reflections | 0.0492 |
Residual factor for significantly intense reflections | 0.0426 |
Weighted residual factors for significantly intense reflections | 0.1158 |
Weighted residual factors for all reflections included in the refinement | 0.1234 |
Goodness-of-fit parameter for all reflections included in the refinement | 1.064 |
Diffraction radiation wavelength | 0.71073 Å |
Diffraction radiation type | MoKα |