Information card for entry 4333441
Formula | C25 H28 Cl4 Fe N4 Se2 |
Calculated formula | C25 H28 Cl4 Fe N4 Se2 |
SMILES | [Se]1[Se]c2[n]([Fe](Cl)(Cl)[n]3c1n(cc3)c1c(cc(cc1C)C)C)ccn2c1c(cc(cc1C)C)C.ClCCl |
Title of publication | Applications of bis(1-R-imidazol-2-yl)disulfides and diselenides as ligands for main-group and transition metals: kappa2-(N,N) coordination, S-S bond cleavage, and S-S/E-E (E = S, Se) bond metathesis reactions. |
Authors of publication | Figueroa, Joshua S.; Yurkerwich, Kevin; Melnick, Jonathan; Buccella, Daniela; Parkin, Gerard |
Journal of publication | Inorganic chemistry |
Year of publication | 2007 |
Journal volume | 46 |
Journal issue | 22 |
Pages of publication | 9234 - 9244 |
a | 8.6315 ± 0.0008 Å |
b | 14.288 ± 0.0014 Å |
c | 25.144 ± 0.003 Å |
α | 90° |
β | 98.144 ± 0.002° |
γ | 90° |
Cell volume | 3069.7 ± 0.6 Å3 |
Cell temperature | 243 ± 2 K |
Ambient diffraction temperature | 243 ± 2 K |
Number of distinct elements | 6 |
Space group number | 14 |
Hermann-Mauguin space group symbol | P 1 21/n 1 |
Hall space group symbol | -P 2yn |
Residual factor for all reflections | 0.0836 |
Residual factor for significantly intense reflections | 0.0392 |
Weighted residual factors for significantly intense reflections | 0.0828 |
Weighted residual factors for all reflections included in the refinement | 0.0981 |
Goodness-of-fit parameter for all reflections included in the refinement | 1.02 |
Diffraction radiation wavelength | 0.71073 Å |
Diffraction radiation type | MoKα |