Information card for entry 4333496
Formula | F9 H4 K3 N O4 P Ti2 |
Calculated formula | F9 H4 K3 N O4 P Ti2 |
Title of publication | Syntheses and Structural Characterization of a Series of One-Dimensional Fluorotitanophosphates (NH4)xK4 - x[Ti2PO4F9] (x= 0, 0.70, 1.00, 1.25) |
Authors of publication | Yang, Sihai; Li, Guobao; Li, Lei; Tian, Shujian; Liao, Fuhui; Xiong, Ming; Lin, Jianhua |
Journal of publication | Inorganic Chemistry |
Year of publication | 2007 |
Journal volume | 46 |
Journal issue | 26 |
Pages of publication | 11431 - 11436 |
a | 5.8777 ± 0.0012 Å |
b | 10.991 ± 0.002 Å |
c | 10.219 ± 0.002 Å |
α | 90° |
β | 106.04 ± 0.03° |
γ | 90° |
Cell volume | 634.5 ± 0.2 Å3 |
Cell temperature | 298 ± 2 K |
Ambient diffraction temperature | 298 ± 2 K |
Number of distinct elements | 7 |
Space group number | 11 |
Hermann-Mauguin space group symbol | P 1 21/m 1 |
Hall space group symbol | -P 2yb |
Residual factor for all reflections | 0.0403 |
Residual factor for significantly intense reflections | 0.036 |
Weighted residual factors for significantly intense reflections | 0.0881 |
Weighted residual factors for all reflections included in the refinement | 0.0905 |
Goodness-of-fit parameter for all reflections included in the refinement | 1 |
Diffraction radiation wavelength | 0.71073 Å |
Diffraction radiation type | MoKα |