Information card for entry 4333575
Common name | Au2(dpp-hexane)2I2 |
Formula | C60 H64 Au2 I2 P4 |
Calculated formula | C60 H64 Au2 I2 P4 |
SMILES | c1(ccccc1)[P]1(c2ccccc2)[Au](I)[P](CCCCCC[P](c2ccccc2)(c2ccccc2)[Au](I)[P](CCCCCC1)(c1ccccc1)c1ccccc1)(c1ccccc1)c1ccccc1 |
Title of publication | Crystallographic and Computational Studies of Luminescent, Binuclear Gold(I) Complexes, AuI2(Ph2P(CH2)nPPh2)2I2 (n= 3-6) |
Authors of publication | Sang Ho Lim; Jennifer C. Schmitt; Jason Shearer; Jianhua Jia; Marilyn M. Olmstead; James C. Fettinger; Alan L. Balch |
Journal of publication | Inorganic Chemistry |
Year of publication | 2013 |
Journal volume | 52 |
Pages of publication | 823 - 831 |
a | 9.984 ± 0.002 Å |
b | 11.648 ± 0.002 Å |
c | 12.673 ± 0.002 Å |
α | 101.425 ± 0.005° |
β | 93.982 ± 0.005° |
γ | 100.789 ± 0.005° |
Cell volume | 1410.3 ± 0.4 Å3 |
Cell temperature | 90 ± 2 K |
Ambient diffraction temperature | 90 ± 2 K |
Number of distinct elements | 5 |
Space group number | 2 |
Hermann-Mauguin space group symbol | P -1 |
Hall space group symbol | -P 1 |
Residual factor for all reflections | 0.0147 |
Residual factor for significantly intense reflections | 0.014 |
Weighted residual factors for significantly intense reflections | 0.0332 |
Weighted residual factors for all reflections included in the refinement | 0.0334 |
Goodness-of-fit parameter for all reflections included in the refinement | 1.047 |
Diffraction radiation wavelength | 0.71073 Å |
Diffraction radiation type | MoKα |