Information card for entry 4335637
Common name | beta-Formamidinium_Tin_Iodide |
Formula | C H5 I3 N2 Sn |
Calculated formula | C I3 N2 Sn |
Title of publication | Semiconducting Tin and Lead Iodide Perovskites with Organic Cations: Phase Transitions, High Mobilities, and Near-Infrared Photoluminescent Properties |
Authors of publication | Constantinos C. Stoumpos; Christos D. Malliakas; Mercouri G. Kanatzidis |
Journal of publication | Inorganic Chemistry |
Year of publication | 2013 |
Journal volume | 52 |
Pages of publication | 9019 - 9038 |
a | 12.5121 ± 0.0009 Å |
b | 12.5171 ± 0.0008 Å |
c | 12.5099 ± 0.0009 Å |
α | 90° |
β | 90° |
γ | 90° |
Cell volume | 1959.2 ± 0.2 Å3 |
Cell temperature | 180 ± 2 K |
Ambient diffraction temperature | 180 ± 2 K |
Number of distinct elements | 5 |
Space group number | 44 |
Hermann-Mauguin space group symbol | I m m 2 |
Hall space group symbol | I 2 -2 |
Residual factor for all reflections | 0.078 |
Residual factor for significantly intense reflections | 0.0486 |
Weighted residual factors for significantly intense reflections | 0.1276 |
Weighted residual factors for all reflections included in the refinement | 0.1432 |
Goodness-of-fit parameter for all reflections included in the refinement | 0.963 |
Diffraction radiation wavelength | 0.71073 Å |
Diffraction radiation type | MoKα |